Skip to content

[ci] CHANGELOG for Node/Standalone chrome browser versions with Grid 4.34.0 #3374

[ci] CHANGELOG for Node/Standalone chrome browser versions with Grid 4.34.0

[ci] CHANGELOG for Node/Standalone chrome browser versions with Grid 4.34.0 #3374

Triggered via pull request July 5, 2025 14:21
Status Failure
Total duration 49m 39s
Artifacts 33

build-test.yml

on: pull_request
Matrix: Test Selenium Grid on Docker / Test Docker Selenium
Matrix: Test Selenium Grid on Kubernetes / Test K8s
Rerun workflow when failure
11s
Rerun workflow when failure
Fit to window
Zoom out
Zoom in

Annotations

9 errors and 28 warnings
Test Selenium Grid on Docker / Test Docker Selenium (test_node_relay, false, false, false, ubuntu-24.04)
Exception: Message: Could not start a new session. Could not start a new session. Error while creating session with the service http://emulator:4723. Could not start a new session. Response code 500. Message: An unknown server-side error occurred while processing the command. Original error: An unknown server-side error occurred while processing the command. Original error: chrome not reachable
Test Selenium Grid on Kubernetes / Test K8s (v1.33.1, minikube, v3.18.0, 26.1.4, 3.10, true, true, ubuntu-22.04, false, job_relay)
Exception: Message: Could not start a new session. java.io.IOException: Task jdk.internal.net.http.common.SequentialScheduler$SchedulableTask@27eb900 rejected from java.util.concurrent.ThreadPoolExecutor@618bd2f4[Shutting down, pool size = 2, active threads = 2, queued tasks = 0, completed tasks = 8]
Test Selenium Grid on Kubernetes / Test K8s (v1.31.9, minikube, v3.16.4, 27.4.1, 3.13, true, false, ubuntu-22.04, true, deployment_h...
Exception: Message: java.net.http.HttpTimeoutException: request timed out
Rerun workflow when failure
Process completed with exit code 1.
Test Selenium Grid on Docker / Test Docker Selenium (test_video_standalone, false, true, false, ubuntu-24.04-arm, true, true)
Attempt 2 failed. Reason: Child_process exited with error code 2
Test Selenium Grid on Docker / Test Docker Selenium (test_video_standalone, false, true, false, ubuntu-24.04-arm, true, true)
Attempt 1 failed. Reason: Child_process exited with error code 2
Test Selenium Grid on Docker / Test Docker Selenium (test_parallel, false, false, false, ubuntu-24.04)
Number of failed tests: 5. All tests passed in rerun!
Test Selenium Grid on Docker / Test Docker Selenium (test_node_relay, false, false, false, ubuntu-24.04)
Attempt 1 failed. Reason: Child_process exited with error code 2
Test Selenium Grid on Kubernetes / Test K8s (v1.33.1, minikube, v3.18.0, 26.1.4, 3.10, true, true, ubuntu-22.04, false, job_relay)
No files were found with the provided path: ./tests/videos/ !./tests/videos/**/*.hprof. No artifacts will be uploaded.

Artifacts

Produced during runtime
Name Size Digest
test_node_docker_artifacts_ubuntu-24.04 Expired
1.52 MB
sha256:f0cd39aacba8fcd2acda68578107438c0b2fc5a05e395aba4add7c4206988b81
test_node_docker_artifacts_ubuntu-24.04-arm Expired
1.46 MB
sha256:4b9769e0076c5b4f572d4eea50b83aeeed16031b8a0e4f3fae8b4bc8db22e233
test_standalone_docker_artifacts_ubuntu-24.04 Expired
1.11 MB
sha256:2278492b62a2fcdcc2fbaf15575a5045f77ccdadee2e349c857b1eb27cc3e2c3
test_standalone_docker_artifacts_ubuntu-24.04-arm Expired
1.22 MB
sha256:9ee8750c4940fa5fbb13f2e2385c13974f8a897cded5708d23e8f3952a797a20
test_video_artifacts_ubuntu-24.04 Expired
5.01 MB
sha256:f44bec89e58d6ed0a762cb4f4701e7f5b301510eec8d2e6f604b315df2385fd1
test_video_artifacts_ubuntu-24.04-arm Expired
2.62 MB
sha256:072c0612ed30e8cfaa506887836784823d954fff88bb0a087d6a87c320fc9046
test_video_dynamic_name_artifacts_ubuntu-24.04 Expired
5.32 MB
sha256:5e89950cf7829d924a8f4bd16dbfa4e37ff18a38d25f1a7e24e9288fca86e9f3
test_video_dynamic_name_artifacts_ubuntu-24.04-arm Expired
2.86 MB
sha256:b1bde39f6097208dcf280ef7344377411fb5cc093bde254907ad3baed6dd53a0
test_video_standalone_artifacts_ubuntu-24.04 Expired
4.64 MB
sha256:4bc4afe48329e08241576fb176946fc4c837c5ca95bd715460a1ad15d61985e1
test_video_standalone_artifacts_ubuntu-24.04-arm Expired
2.65 MB
sha256:a97f270e55652d403db4d5a65027346fb00f79221c9b5b49e0a01d6c1531bd87
v1.26.15-disabled-artifacts Expired
16.8 KB
sha256:39d12fea608cdd8d54e8084c66bd6d00d013abe4ee61dc6400bd8baa669e80c6
v1.26.15-disabled-videos Expired
4.1 MB
sha256:cd19a108963775d3ea15d0f88ffe86f82cc5825dcce281a28644f23e7ea03648
v1.26.15-disabled_selenium-grid-4.35.0-SNAPSHOT-20250705.tgz_ubuntu-22.04 Expired
1.7 MB
sha256:b81dcfa69eb5c7a1e533575e4522c1c22f349b0ec1b3c6f3e2ff4f2a8435a733
v1.27.16-job-artifacts Expired
30.6 KB
sha256:c54d3a93c5e9cb8c7c556c59c6e4296b1610572d6ce6bc3b51dabd1347970e59
v1.27.16-job-videos Expired
3.29 MB
sha256:320f639c5476832e2da5346db5f83e1285fd72d3106c7628fbe53ff4f5b816bf
v1.27.16-job_selenium-grid-4.35.0-SNAPSHOT-20250705.tgz_ubuntu-22.04 Expired
1.7 MB
sha256:c9428d4af5c22e6f68ed0474f94dd354295a72061ef4ef37f7b6e9470704bdd8
v1.28.15-deployment-artifacts Expired
18.3 KB
sha256:84b6158cc81f59fde00fe76b589e21da4efbe3b84f8dcddc7aa624c0d2811862
v1.28.15-deployment-videos Expired
4.29 MB
sha256:634fd20ad4bfabaa9c27f879c0bfc19b97e64067f7d031dcf93bd12a79aac825
v1.28.15-deployment_selenium-grid-4.35.0-SNAPSHOT-20250705.tgz_ubuntu-22.04 Expired
1.7 MB
sha256:a6c7be0a709d4e5359eb667af27e745afb58bee68d4d62ff95f669c91b28a286
v1.29.15-job_https-artifacts Expired
24.2 KB
sha256:370aa3362f12c1d927d1b5045856ff4f6cefc336e9ad13bda56dcc3fb01900f3
v1.29.15-job_https-videos Expired
2.57 MB
sha256:73a2d33ac5c592e5233ef935111bcdd900202909694099285b1590ffd212ed3c
v1.29.15-job_https_selenium-grid-4.35.0-SNAPSHOT-20250705.tgz_ubuntu-22.04 Expired
1.7 MB
sha256:babb767b3cd973b580dc8c0d92f64c1cc22e2d9203bc77d0a11f259c1bdc83ae
v1.30.13-job_hostname-artifacts Expired
148 KB
sha256:fbb0fb20e60b53b7151b65c916ec703cb924696706431b31607bc87b28ba392e
v1.30.13-job_hostname-videos Expired
4.49 MB
sha256:79ff13729090d67294f78b1a3eec5067daa3a0336902860e0269bc2ed268057a
v1.30.13-job_hostname_selenium-grid-4.35.0-SNAPSHOT-20250705.tgz_ubuntu-22.04 Expired
1.7 MB
sha256:492c373ee9fd8ca65aa0cb1a3f45a7cfacf437c57a30de605b16150fe1219316
v1.31.9-deployment_https-artifacts Expired
118 KB
sha256:df61bede79459d52ef63ffbcd55132f025790c40bc4dbc124cabc055a05354b1
v1.31.9-deployment_https-videos Expired
3.43 MB
sha256:f977bc7f73bc9e1309f78bf6b8c7d8636504302e2c6432d0221566733070e290
v1.31.9-deployment_https_selenium-grid-4.35.0-SNAPSHOT-20250705.tgz_ubuntu-22.04 Expired
1.7 MB
sha256:5cea852e9deb43290c2eb444b0f591a4d12f04aad8e5edae246172d24cdd63c4
v1.32.5-playwright_connect_grid-artifacts Expired
151 KB
sha256:e289870693a4e421df1564be3e455d6029a0d0a52e4c804c164208dfdfb49b51
v1.32.5-playwright_connect_grid-videos Expired
1.42 MB
sha256:87a4113980f32a58b7d91257698b6230de93bb65d92c7a7ab85c382701530584
v1.32.5-playwright_connect_grid_selenium-grid-4.35.0-SNAPSHOT-20250705.tgz_ubuntu-22.04 Expired
1.7 MB
sha256:11e2d589b87413523b4c74c6c5fbab70f122b38a4f1bfff1f7042baf3e70d213
v1.33.1-job_relay-artifacts Expired
155 KB
sha256:ed42d8441aef2bd884cb1125a24ba318c6f783d6c48fdf67be9ad616ac4df2c4
v1.33.1-job_relay_selenium-grid-4.35.0-SNAPSHOT-20250705.tgz_ubuntu-22.04 Expired
1.7 MB
sha256:863fefab9374a49ae9606c9ea691cc960913b9d09526b7017bc3eb7087211031