INTEGRATION TEST FAILURES
—————————————————————————
remote_config:
Errors and Failures (1):
- [TEST] [FAILURE] [2021] [1/2 Build OS(s): windows] [1/6 Platform(s): Android] [1/3 Test Device(s): android_target]
/Users/runner/work/firebase-unity-sdk/firebase-unity-sdk/testapps/firebaseai/MacOSTestapp/testapp.app/Contents/MacOS/Firebase AI Unity Testapp:
Errors and Failures (1):
- [TEST] [FAILURE] [2021] [1/2 Build OS(s): windows] [1/6 Platform(s): macOS] [1/3 Test Device(s): github_runner]